BDBM50080202 (S)-4-[(S)-2-Acetylamino-3-(4-phosphonooxy-phenyl)-propionylamino]-4-[4-(3-methyl-butyl)-thiazol-2-yl]-butyric acid::CHEMBL77068
SMILES CC(C)CCc1csc(n1)[C@H](CCC(O)=O)NC(=O)[C@H](Cc1ccc(OP(O)(O)=O)cc1)NC(C)=O
InChI Key InChIKey=GHQBXWVXHMMSES-PMACEKPBSA-N
Data  1 IC50
  Tab Delimited (TSV)   2D SDfile   Computed 3D by Vconf -m prep SDfile
Find this compound or compounds like it in BindingDB:
Activity Spreadsheet -- Enzyme Inhibition Constant Data from BindingDB
Found 1 hit for monomerid = 50080202
TargetProto-oncogene tyrosine-protein kinase Src(Homo sapiens (Human))
Ariad Pharmaceuticals
Curated by ChEMBL
LigandPNGBDBM50080202((S)-4-[(S)-2-Acetylamino-3-(4-phosphonooxy-phenyl)...)
Affinity DataIC50:  7.60E+4nM. Assay description: Binding affinity against Src-homology 2 (SRC SH2).
In DepthDetails ArticlePubMed